{"text_format":"1","workbook":"xlsx","n_sheets":9,"sheets":["EE un ilgtsp.fin.novērt.","Energoefektivitātes pasākumi","AER pašpatēriņam","Atjaunojamā enerģija","Zaļo ēku celtniecība","Ēku atjaunošana","Transporta risinājumi","Enerģijas izmaksu samazināšana","Izvelnes"],"not_rendered":{"charts":0,"images":2,"macros":1,"external_links":0,"defined_names":10,"comments":0,"pivot_tables":0},"unopened":[],"bounds":{"document_bytes":16777216,"sheet_cells":100000,"rows_first":2000,"rows_last":500,"rows_between":2000,"halvings":0,"cell_chars":16384,"cell_head_chars":4096},"cells_cut":0,"cells_raw":0,"read":"whole","date_system":"1900"}

{"sheet":"EE un ilgtsp.fin.novērt.","index":0,"n_rows":93,"n_cols":13,"rows_kept":93,"cut":false,"hidden":false,"merged":[[79,6,80,7],[81,6,82,7],[90,2,90,4],[89,2,89,4],[2,6,6,12],[85,1,85,12],[86,1,86,9],[79,1,80,1],[10,2,10,5],[10,6,10,7],[11,2,11,5],[11,6,11,7],[12,1,13,1],[12,2,12,5],[60,1,61,1],[75,1,75,4],[22,1,23,1],[35,1,35,4],[15,5,16,9],[75,6,75,8],[22,2,22,5],[22,6,22,9],[74,6,74,8],[60,2,60,5],[34,6,34,8],[35,6,35,8],[60,6,60,9],[58,1,58,9],[59,1,59,9],[39,1,40,1],[39,2,39,5],[39,6,39,9]]}
[]
[]
[null,null,null,null,null,null,"PROJEKTA ENERGOEFEKTIVITĀTES UN/ VAI ILGTSPĒJAS \nFINANSIĀLAIS NOVĒRTĒJUMS"]
[]
[]
[]
[]
[]
[null,"Vispārīga informācija"]
[]
[null,"Klients"]
[null,null,"Nosaukums",null,null,null,"Reģistrācijas Nr."]
[null,"Kādu energoefektivitātes/ ilgtspējas pasākumu plāno īstenot?"]
[]
[]
[null,"Kopējās projekta izmaksas, EUR"]
[null,"Aizdevuma summa, EUR"]
[]
[]
[]
{"$rows_left_out":74}
{"sheet":"Energoefektivitātes pasākumi","index":1,"n_rows":45,"n_cols":19,"rows_kept":45,"cut":false,"hidden":true,"merged":[[37,14,38,15],[39,14,40,15],[19,14,19,15],[19,16,19,17],[17,14,17,17],[19,7,19,11],[16,4,16,8],[40,1,41,2],[6,4,6,8],[36,7,36,9],[7,4,7,8],[8,4,8,8],[9,4,9,8],[10,4,10,8],[11,4,11,8],[12,4,12,8],[13,4,13,8],[14,4,14,8],[15,4,15,8],[6,1,10,2],[42,1,42,2],[43,1,43,2],[44,1,44,2],[19,1,20,1],[19,2,19,6]]}
[]
[null,null,null,null,null,null,null,null,null,null,null,null,null,null,null,null,null,null,"ENERGOEFEKTIVITĀTES PASĀKUMU"]
[null,null,null,null,null,null,null,null,null,null,null,null,null,null,null,null,null,null,"energoresursu patēriņš"]
[]
[null,"Šo lapu aizpildiet, ja plānojat īstenot energoefektivitātes pasākumus!"]
[]
[null,"Ja projektam ir tieša ietekme uz apgrozījuma pieaugumu, atzīmējiet vismaz vienu produktu, pret kuru aprēķināms energoresursu ietaupījums uz vienību!",null,{"$f":"IF(OR('EE un ilgtsp.fin.novērt.'!#REF!,'EE un ilgtsp.fin.novērt.'!#REF!,'EE un ilgtsp.fin.novērt.'!#REF!,'EE un ilgtsp.fin.novērt.'!#REF!,'EE un ilgtsp.fin.novērt.'!#REF!,'EE un ilgtsp.fin.novērt.'!#REF!,'EE un ilgtsp.fin.novērt.'!#REF!,'EE un ilgtsp.fin.novērt.'!#REF!,'EE un ilgtsp.fin.novērt.'!#REF!,'EE un ilgtsp.fin.novērt.'!#REF!),\"I\",\"\")","v":{"$error":"#REF!"}},{"$f":"IF(OR('EE un ilgtsp.fin.novērt.'!#REF!,'EE un ilgtsp.fin.novērt.'!#REF!,'EE un ilgtsp.fin.novērt.'!#REF!,'EE un ilgtsp.fin.novērt.'!#REF!,'EE un ilgtsp.fin.novērt.'!#REF!,'EE un ilgtsp.fin.novērt.'!#REF!,'EE un ilgtsp.fin.novērt.'!#REF!,'EE un ilgtsp.fin.novērt.'!#REF!,'EE un ilgtsp.fin.novērt.'!#REF!,'EE un ilgtsp.fin.novērt.'!#REF!),\"\",\"\")","v":{"$error":"#REF!"}}]
[null,null,null,null,{"$f":"'EE un ilgtsp.fin.novērt.'!B25","v":0}]
[null,null,null,null,{"$f":"'EE un ilgtsp.fin.novērt.'!B26","v":0}]
[null,null,null,null,{"$f":"'EE un ilgtsp.fin.novērt.'!B27","v":0}]
[null,null,null,null,{"$f":"'EE un ilgtsp.fin.novērt.'!B28","v":0}]
[null,null,null,null,{"$f":"'EE un ilgtsp.fin.novērt.'!B29","v":0}]
[null,null,null,null,{"$f":"'EE un ilgtsp.fin.novērt.'!B30","v":0}]
[null,null,null,null,{"$f":"'EE un ilgtsp.fin.novērt.'!B31","v":0}]
[null,null,null,null,{"$f":"'EE un ilgtsp.fin.novērt.'!B32","v":0}]
[null,null,null,null,{"$f":"'EE un ilgtsp.fin.novērt.'!B33","v":0}]
[null,null,null,null,{"$f":"'EE un ilgtsp.fin.novērt.'!B34","v":0}]
[null,"Lūdzu norādiet tabulā esošos un plānotos energoresursu apjomus, kuri tiks ietaupīti pēc projekta īstenošanas:",null,null,null,null,null,null,null,null,null,null,null,null,"Enerģijas ietaupījums"]
[]
[null,"Izejviela","Esošie apjomi gadā",null,null,null,null,"Izmaiņas pēc projekta īstenošanas",null,null,null,null,null,null,"Ietaupījums",null,"Ietaupījums uz 1 vienību"]
{"$rows_left_out":26}
{"sheet":"AER pašpatēriņam","index":2,"n_rows":45,"n_cols":19,"rows_kept":45,"cut":false,"hidden":true,"merged":[[44,1,44,2],[36,7,36,9],[37,14,38,15],[39,14,40,15],[40,1,41,2],[42,1,42,2],[43,1,43,2],[17,14,17,17],[19,1,20,1],[19,2,19,6],[19,7,19,11],[19,14,19,15],[19,16,19,17],[16,4,16,8],[6,1,9,2],[6,4,6,8],[7,4,7,8],[8,4,8,8],[9,4,9,8],[10,4,10,8],[11,4,11,8],[12,4,12,8],[13,4,13,8],[14,4,14,8],[15,4,15,8]]}
[]
[null,null,null,null,null,null,null,null,null,null,null,null,null,null,null,null,null,null,"AER PASĀKUMI PAŠPATĒRIŅAM"]
[null,null,null,null,null,null,null,null,null,null,null,null,null,null,null,null,null,null,"energoresursu patēriņš"]
[]
[null,"Šo lapu aizpildiet, ja plānojat īstenot atjaunojamās enerģijas pasākumus pašpatēriņam!"]
[]
[null,"Balstoties uz kuriem no ieņēmumu tabulā norādītajiem produktiem/pakalpojumiem tiks rēķināta iegūstamā efektivitāte/ ilgtspēja?",null,{"$f":"IF(OR('EE un ilgtsp.fin.novērt.'!#REF!,'EE un ilgtsp.fin.novērt.'!#REF!,'EE un ilgtsp.fin.novērt.'!#REF!,'EE un ilgtsp.fin.novērt.'!#REF!,'EE un ilgtsp.fin.novērt.'!#REF!,'EE un ilgtsp.fin.novērt.'!#REF!,'EE un ilgtsp.fin.novērt.'!#REF!,'EE un ilgtsp.fin.novērt.'!#REF!,'EE un ilgtsp.fin.novērt.'!#REF!,'EE un ilgtsp.fin.novērt.'!#REF!),\"I\",\"\")","v":{"$error":"#REF!"}},{"$f":"IF(OR('EE un ilgtsp.fin.novērt.'!#REF!,'EE un ilgtsp.fin.novērt.'!#REF!,'EE un ilgtsp.fin.novērt.'!#REF!,'EE un ilgtsp.fin.novērt.'!#REF!,'EE un ilgtsp.fin.novērt.'!#REF!,'EE un ilgtsp.fin.novērt.'!#REF!,'EE un ilgtsp.fin.novērt.'!#REF!,'EE un ilgtsp.fin.novērt.'!#REF!,'EE un ilgtsp.fin.novērt.'!#REF!,'EE un ilgtsp.fin.novērt.'!#REF!),\"\",\"Izvēlieties vismaz 1 produktu !\")","v":{"$error":"#REF!"}}]
[null,null,null,null,{"$f":"'EE un ilgtsp.fin.novērt.'!B25","v":0}]
[null,null,null,null,{"$f":"'EE un ilgtsp.fin.novērt.'!B26","v":0}]
[null,null,null,null,{"$f":"'EE un ilgtsp.fin.novērt.'!B27","v":0}]
[null,null,null,null,{"$f":"'EE un ilgtsp.fin.novērt.'!B28","v":0}]
[null,null,null,null,{"$f":"'EE un ilgtsp.fin.novērt.'!B29","v":0}]
[null,null,null,null,{"$f":"'EE un ilgtsp.fin.novērt.'!B30","v":0}]
[null,null,null,null,{"$f":"'EE un ilgtsp.fin.novērt.'!B31","v":0}]
[null,null,null,null,{"$f":"'EE un ilgtsp.fin.novērt.'!B32","v":0}]
[null,null,null,null,{"$f":"'EE un ilgtsp.fin.novērt.'!B33","v":0}]
[null,null,null,null,{"$f":"'EE un ilgtsp.fin.novērt.'!B34","v":0}]
[null,"Lūdzu norādiet tabulā esošos un plānotos energoresursu apjomus, kuri tiks ietaupīti pēc projekta īstenošanas:",null,null,null,null,null,null,null,null,null,null,null,null,"Enerģijas ietaupījums"]
[]
[null,"Izejviela","Esošie apjomi gadā",null,null,null,null,"Izmaiņas pēc projekta īstenošanas",null,null,null,null,null,null,"Ietaupījums",null,"Ietaupījums uz 1 vienību"]
{"$rows_left_out":26}
{"sheet":"Atjaunojamā enerģija","index":3,"n_rows":56,"n_cols":18,"rows_kept":56,"cut":false,"hidden":true,"merged":[[6,1,8,2],[19,1,20,1],[19,2,19,6],[19,7,19,11],[19,14,19,15],[6,4,6,8],[7,4,7,8],[8,4,8,8],[9,4,9,8],[10,4,10,8],[11,4,11,8],[12,4,12,8],[13,4,13,8],[14,4,14,8],[15,4,15,8],[16,4,16,8],[40,1,41,2],[19,16,19,17],[36,1,37,2],[36,7,36,9],[37,14,38,15],[39,14,40,15],[46,1,48,2],[50,3,52,12],[50,1,52,2],[42,1,42,2],[43,1,43,2],[44,1,44,2]]}
[]
[null,null,null,null,null,null,null,null,null,null,null,null,null,null,null,"ATJAUNOJAMĀS ENERĢIJAS PASĀKUMU"]
[null,null,null,null,null,null,null,null,null,null,null,null,null,null,null,"energoresursu patēriņš"]
[]
[null,"Šo lapu aizpildiet, ja plānojat īstenot atjaunojamās enerģijas pasākumus enerģijas nodošanai tīklā!"]
[]
[null,"Balstoties uz kuriem no ieņēmumu tabulā norādītajiem produktiem/pakalpojumiem tiks rēķināta  iegūstamā efektivitāte/ ilgtspēja?",null,{"$f":"IF(OR('EE un ilgtsp.fin.novērt.'!#REF!,'EE un ilgtsp.fin.novērt.'!#REF!,'EE un ilgtsp.fin.novērt.'!#REF!,'EE un ilgtsp.fin.novērt.'!#REF!,'EE un ilgtsp.fin.novērt.'!#REF!,'EE un ilgtsp.fin.novērt.'!#REF!,'EE un ilgtsp.fin.novērt.'!#REF!,'EE un ilgtsp.fin.novērt.'!#REF!,'EE un ilgtsp.fin.novērt.'!#REF!,'EE un ilgtsp.fin.novērt.'!#REF!),\"I\",\"\")","v":{"$error":"#REF!"}},{"$f":"IF(OR('EE un ilgtsp.fin.novērt.'!#REF!,'EE un ilgtsp.fin.novērt.'!#REF!,'EE un ilgtsp.fin.novērt.'!#REF!,'EE un ilgtsp.fin.novērt.'!#REF!,'EE un ilgtsp.fin.novērt.'!#REF!,'EE un ilgtsp.fin.novērt.'!#REF!,'EE un ilgtsp.fin.novērt.'!#REF!,'EE un ilgtsp.fin.novērt.'!#REF!,'EE un ilgtsp.fin.novērt.'!#REF!,'EE un ilgtsp.fin.novērt.'!#REF!),\"\",\"Izvēlieties vismaz 1 produktu !\")","v":{"$error":"#REF!"}}]
[null,null,null,null,{"$f":"'EE un ilgtsp.fin.novērt.'!B25","v":0}]
[null,null,null,null,{"$f":"'EE un ilgtsp.fin.novērt.'!B26","v":0}]
[null,null,null,null,{"$f":"'EE un ilgtsp.fin.novērt.'!B27","v":0}]
[null,null,null,null,{"$f":"'EE un ilgtsp.fin.novērt.'!B28","v":0}]
[null,null,null,null,{"$f":"'EE un ilgtsp.fin.novērt.'!B29","v":0}]
[null,null,null,null,{"$f":"'EE un ilgtsp.fin.novērt.'!B30","v":0}]
[null,null,null,null,{"$f":"'EE un ilgtsp.fin.novērt.'!B31","v":0}]
[null,null,null,null,{"$f":"'EE un ilgtsp.fin.novērt.'!B32","v":0}]
[null,null,null,null,{"$f":"'EE un ilgtsp.fin.novērt.'!B33","v":0}]
[null,null,null,null,{"$f":"'EE un ilgtsp.fin.novērt.'!B34","v":0}]
[null,"Lūdzu norādiet tabulā esošos un plānotos energoresursu apjomus, kuri tiks ietaupīti pēc projekta īstenošanas (jaunas ražotnes gadījumā ietaupījums var neveidoties!):",null,null,null,null,null,null,null,null,null,null,null,null,"Enerģijas ietaupījums"]
[]
[null,"Izejviela","Esošie apjomi gadā",null,null,null,null,"Izmaiņas pēc projekta īstenošanas",null,null,null,null,null,null,"Ietaupījums",null,"Ietaupījums uz 1 vienību"]
{"$rows_left_out":37}
{"sheet":"Zaļo ēku celtniecība","index":4,"n_rows":66,"n_cols":7,"rows_kept":66,"cut":false,"hidden":true,"merged":[[10,1,11,2],[25,1,25,7],[27,1,28,1],[27,2,27,6],[22,3,22,6],[23,3,23,6],[14,1,19,1],[13,3,13,6],[17,3,17,6],[18,3,18,6],[19,3,19,6],[20,3,20,6],[21,3,21,6],[14,3,14,6],[15,3,15,6],[16,3,16,6],[44,1,45,2],[55,1,57,1],[59,1,62,1],[59,2,62,6],[49,3,50,6],[49,1,50,1]]}
[]
[null,null,null,null,null,null,"ZAĻO ĒKU CELTNIECĪBAS PASĀKUMU"]
[null,null,null,null,null,null,"energoresursu patēriņš"]
[]
[null,"Šo lapu aizpildiet, ja plānojat īstenot jaunas zaļās ēkas celtniecības pasākumu!"]
[]
[null,"Kāda būs apsildāmās ēkas platība?"]
[null,null,null,"kv.m"]
[null,"Pagaidu energosertifikāta datums:"]
[]
[null,"Kāds būs plānotais ēkas siltumenerģijas patēriņš saskaņā ar Ēkas pagaidu energosertifikātu?"]
[null,null,null,"kWh/m2"]
[]
[null,null,{"$f":"IF(OR('EE un ilgtsp.fin.novērt.'!J33,'EE un ilgtsp.fin.novērt.'!J34,'EE un ilgtsp.fin.novērt.'!J35,'EE un ilgtsp.fin.novērt.'!J36,'EE un ilgtsp.fin.novērt.'!J37,'EE un ilgtsp.fin.novērt.'!J58,'EE un ilgtsp.fin.novērt.'!J59,'EE un ilgtsp.fin.novērt.'!J60,'EE un ilgtsp.fin.novērt.'!J61,'EE un ilgtsp.fin.novērt.'!J62),\"I\",\"\")","v":""},{"$f":"IF(OR('EE un ilgtsp.fin.novērt.'!#REF!,'EE un ilgtsp.fin.novērt.'!#REF!,'EE un ilgtsp.fin.novērt.'!#REF!,'EE un ilgtsp.fin.novērt.'!#REF!,'EE un ilgtsp.fin.novērt.'!#REF!,'EE un ilgtsp.fin.novērt.'!#REF!,'EE un ilgtsp.fin.novērt.'!#REF!,'EE un ilgtsp.fin.novērt.'!#REF!,'EE un ilgtsp.fin.novērt.'!#REF!,'EE un ilgtsp.fin.novērt.'!#REF!),\"\",\"Izvēlieties vismaz 1 produktu !\")","v":{"$error":"#REF!"}}]
[null,"Balstoties uz kuru no ieņēmumu tabulā norādīto produktu/pakalpojumu tiks rēķināta iegūstamā  efektivitāte/ ilgtspēja?",null,{"$f":"'EE un ilgtsp.fin.novērt.'!B25","v":0}]
[null,null,null,{"$f":"'EE un ilgtsp.fin.novērt.'!B26","v":0}]
[null,null,null,{"$f":"'EE un ilgtsp.fin.novērt.'!B27","v":0}]
[null,null,null,{"$f":"'EE un ilgtsp.fin.novērt.'!B28","v":0}]
[null,null,null,{"$f":"'EE un ilgtsp.fin.novērt.'!B29","v":0}]
[null,null,null,{"$f":"'EE un ilgtsp.fin.novērt.'!B30","v":0}]
{"$rows_left_out":47}
{"sheet":"Ēku atjaunošana","index":5,"n_rows":54,"n_cols":17,"rows_kept":54,"cut":false,"hidden":true,"merged":[[45,12,46,13],[47,12,48,13],[8,1,9,2],[27,1,28,1],[27,2,27,6],[27,7,27,11],[27,12,27,13],[18,3,18,6],[19,3,19,6],[20,3,20,6],[21,3,21,6],[22,3,22,6],[23,3,23,6],[13,3,13,6],[3,5,3,8],[51,6,51,10],[49,1,50,1],[27,14,27,15],[6,1,7,2],[10,1,11,2],[25,12,25,15],[8,5,9,6],[8,9,9,10],[14,1,19,1],[14,3,14,6],[15,3,15,6],[16,3,16,6],[17,3,17,6],[44,1,45,2],[44,7,44,9]]}
[]
[null,null,null,null,null,null,null,null,null,null,null,null,null,null,null,null,"ĒKU ATJAUNOŠANAS PASĀKUMU"]
[null,null,null,null,null,null,null,null,null,null,null,null,null,null,null,null,"energoresursu patēriņš"]
[null,"Šo lapu aizpildiet, ja plānojat īstenot ēku atjaunošanas pasākumus!"]
[null,"Kāda ir apsildāmā ēkas platība?"]
[null,null,null,"kv.m"]
[null,"Kāds ir esošais ēkas siltumenerģijas patēriņš saskaņā ar Ēkas energosertifikātu?"]
[null,null,null,"kWh/m2"]
[null,"Kāds būs plānotais ēkas siltumenerģijas patēriņš saskaņā ar Ēkas pagaidu energosertifikātu?",null,null,null,"Ēkas siltumenerģijas ietaupījums",null,{"$f":"D7-D9","v":0},null,"Ēkas siltumenerģijas ietaupījums %",null,{"$f":"(D7-D9)/D7","v":{"$error":"#DIV/0!"}}]
[null,null,null,"kWh/m2",null,null,null,"kWh/m2"]
[null,"Cik būs projekta izmaksas, kuras tieši ietekmē energoefektivitāti?",null,null,{"$f":"IF(OR(D11=\"\",'EE un ilgtsp.fin.novērt.'!C16=\"\"),\"\",\" (\"&TEXT((D11/'EE un ilgtsp.fin.novērt.'!C16),\"0.00%\")&\" no kopējām izmaksām)\")","v":""}]
[null,null,null,"EUR",{"$f":"IF(OR(D11=\"\",'EE un ilgtsp.fin.novērt.'!C16=\"\"),\"\",IF(D11/'EE un ilgtsp.fin.novērt.'!C16>0.5,\"Nedrīkst pārsniegt 50% no kopējām projekta izmaksām!\",\"\"))","v":""}]
[]
[null,null,null,{"$f":"IF(OR('EE un ilgtsp.fin.novērt.'!#REF!,'EE un ilgtsp.fin.novērt.'!#REF!,'EE un ilgtsp.fin.novērt.'!#REF!,'EE un ilgtsp.fin.novērt.'!#REF!,'EE un ilgtsp.fin.novērt.'!#REF!,'EE un ilgtsp.fin.novērt.'!#REF!,'EE un ilgtsp.fin.novērt.'!#REF!,'EE un ilgtsp.fin.novērt.'!#REF!,'EE un ilgtsp.fin.novērt.'!#REF!,'EE un ilgtsp.fin.novērt.'!#REF!),\"\",\"Izvēlieties vismaz 1 produktu !\")","v":{"$error":"#REF!"}}]
[null,"Balstoties uz kuru no ieņēmumu tabulā norādīto produktu/pakalpojumu tiks rēķināta  iegūstamā efektivitāte/ ilgtspēja?",null,{"$f":"'EE un ilgtsp.fin.novērt.'!B25","v":0}]
[null,null,null,{"$f":"'EE un ilgtsp.fin.novērt.'!B26","v":0}]
[null,null,null,{"$f":"'EE un ilgtsp.fin.novērt.'!B27","v":0}]
[null,null,null,{"$f":"'EE un ilgtsp.fin.novērt.'!B28","v":0}]
[null,null,null,{"$f":"'EE un ilgtsp.fin.novērt.'!B29","v":0}]
[null,null,null,{"$f":"'EE un ilgtsp.fin.novērt.'!B30","v":0}]
{"$rows_left_out":35}
{"sheet":"Transporta risinājumi","index":6,"n_rows":68,"n_cols":18,"rows_kept":68,"cut":false,"hidden":true,"merged":[[25,14,25,17],[27,14,27,15],[27,16,27,17],[45,14,46,15],[47,14,48,15],[6,6,6,7],[8,6,8,7],[27,1,28,1],[27,7,27,11],[13,3,13,6],[14,1,19,1],[14,3,14,6],[15,3,15,6],[16,3,16,6],[17,3,17,6],[18,3,18,6],[19,3,19,6],[20,3,20,6],[49,1,50,2],[52,1,52,2],[21,3,21,6],[22,3,22,6],[23,3,23,6],[27,2,27,6],[55,1,57,2],[59,1,61,2],[59,3,61,11],[53,1,53,2],[51,1,51,2]]}
[]
[null,null,null,null,null,null,null,null,null,null,null,null,null,null,null,null,null,"ILGTSPĒJĪGO TRANSPORTA RISINĀJUMU PASĀKUMU"]
[null,null,null,null,null,null,null,null,null,null,null,null,null,null,null,null,null,"energoresursu patēriņš"]
[null,"Šo lapu aizpildiet, ja plānojat īstenot ilgtspējīga transporta risinājuma pasākumu!"]
[null,"Cik plānots gadā nobraukt, km?"]
[null,null,null,"km"]
[null,"Esošais degvielas patēriņš",null,null,null,{"$f":"IF(OR(D7=\"\",E7=\"\"),\"\",VLOOKUP(D7,Izvelnes!$B$12:$C$17,2,FALSE)*E7)","v":""},{"$f":"IF(OR(D7=\"\",E7=\"\"),\"\",\" (1 L = \" & VLOOKUP(D7,Izvelnes!$B$12:$C$17,2,FALSE)&\" kWh)\")","v":""}]
[null,null,null,"Degviela","Patēriņš, litri","kWh"]
[null,"Plānotais degvielas patēriņš",null,null,null,{"$f":"IF(OR(D9=\"\",E9=\"\"),\"\",VLOOKUP(D9,Izvelnes!$B$12:$C$17,2,FALSE)*E9)","v":""},{"$f":"IF(OR(D9=\"\",E9=\"\"),\"\",\" (1 L = \" & VLOOKUP(D9,Izvelnes!$B$12:$C$17,2,FALSE)&\" kWh)\")","v":""}]
[null,null,null,"Degviela","Patēriņš, litri","kWh"]
[null,"Aizstātā fosilā enerģija:",null,{"$f":"IF(F7=\"\",0,F7&\" kWh\")","v":0}]
[]
[]
[null,null,null,{"$f":"IF(OR('EE un ilgtsp.fin.novērt.'!#REF!,'EE un ilgtsp.fin.novērt.'!#REF!,'EE un ilgtsp.fin.novērt.'!#REF!,'EE un ilgtsp.fin.novērt.'!#REF!,'EE un ilgtsp.fin.novērt.'!#REF!,'EE un ilgtsp.fin.novērt.'!#REF!,'EE un ilgtsp.fin.novērt.'!#REF!,'EE un ilgtsp.fin.novērt.'!#REF!,'EE un ilgtsp.fin.novērt.'!#REF!,'EE un ilgtsp.fin.novērt.'!#REF!),\"\",\"Izvēlieties vismaz 1 produktu !\")","v":{"$error":"#REF!"}}]
[null,"Balstoties uz kuru no ieņēmumu tabulā norādīto produktu/pakalpojumu tiks rēķināta iegūstamā  efektivitāte/ ilgtspēja?",null,{"$f":"'EE un ilgtsp.fin.novērt.'!B25","v":0}]
[null,null,null,{"$f":"'EE un ilgtsp.fin.novērt.'!B26","v":0}]
[null,null,null,{"$f":"'EE un ilgtsp.fin.novērt.'!B27","v":0}]
[null,null,null,{"$f":"'EE un ilgtsp.fin.novērt.'!B28","v":0}]
[null,null,null,{"$f":"'EE un ilgtsp.fin.novērt.'!B29","v":0}]
[null,null,null,{"$f":"'EE un ilgtsp.fin.novērt.'!B30","v":0}]
{"$rows_left_out":49}
{"sheet":"Enerģijas izmaksu samazināšana","index":7,"n_rows":45,"n_cols":19,"rows_kept":45,"cut":false,"hidden":true,"merged":[[39,14,40,15],[17,14,17,17],[15,4,15,8],[19,14,19,15],[19,16,19,17],[5,5,5,8],[37,14,38,15],[10,4,10,8],[11,4,11,8],[12,4,12,8],[13,4,13,8],[14,4,14,8],[6,4,6,8],[7,4,7,8],[8,4,8,8],[9,4,9,8],[6,1,9,2],[43,1,43,2],[44,1,44,2],[16,4,16,8],[36,1,37,2],[19,1,20,1],[19,2,19,6],[19,7,19,11],[36,7,36,9],[42,1,42,2],[40,1,41,2]]}
[]
[null,null,null,null,null,null,null,null,null,null,null,null,null,null,null,null,null,null,"ENERĢIJAS IZMAKSU SAMAZINĀŠANAS PASĀKUMU"]
[null,null,null,null,null,null,null,null,null,null,null,null,null,null,null,null,null,null,"energoresursu patēriņš"]
[]
[null,"Šo lapu aizpildiet, ja plānojat īstenot enerģijas izmaksu samazināšanas pasākumu!"]
[]
[null,"Balstoties uz kuriem no ieņēmumu tabulā norādītajiem produktiem/pakalpojumiem tiks rēķināta iegūstamā efektivitāte/ ilgtspēja?",null,{"$f":"IF(OR('EE un ilgtsp.fin.novērt.'!#REF!,'EE un ilgtsp.fin.novērt.'!#REF!,'EE un ilgtsp.fin.novērt.'!#REF!,'EE un ilgtsp.fin.novērt.'!#REF!,'EE un ilgtsp.fin.novērt.'!#REF!,'EE un ilgtsp.fin.novērt.'!#REF!,'EE un ilgtsp.fin.novērt.'!#REF!,'EE un ilgtsp.fin.novērt.'!#REF!,'EE un ilgtsp.fin.novērt.'!#REF!,'EE un ilgtsp.fin.novērt.'!#REF!),\"I\",\"\")","v":{"$error":"#REF!"}},{"$f":"IF(OR('EE un ilgtsp.fin.novērt.'!#REF!,'EE un ilgtsp.fin.novērt.'!#REF!,'EE un ilgtsp.fin.novērt.'!#REF!,'EE un ilgtsp.fin.novērt.'!#REF!,'EE un ilgtsp.fin.novērt.'!#REF!,'EE un ilgtsp.fin.novērt.'!#REF!,'EE un ilgtsp.fin.novērt.'!#REF!,'EE un ilgtsp.fin.novērt.'!#REF!,'EE un ilgtsp.fin.novērt.'!#REF!,'EE un ilgtsp.fin.novērt.'!#REF!),\"\",\"Izvēlieties vismaz 1 produktu !\")","v":{"$error":"#REF!"}}]
[null,null,null,null,{"$f":"'EE un ilgtsp.fin.novērt.'!B25","v":0}]
[null,null,null,null,{"$f":"'EE un ilgtsp.fin.novērt.'!B26","v":0}]
[null,null,null,null,{"$f":"'EE un ilgtsp.fin.novērt.'!B27","v":0}]
[null,null,null,null,{"$f":"'EE un ilgtsp.fin.novērt.'!B28","v":0}]
[null,null,null,null,{"$f":"'EE un ilgtsp.fin.novērt.'!B29","v":0}]
[null,null,null,null,{"$f":"'EE un ilgtsp.fin.novērt.'!B30","v":0}]
[null,null,null,null,{"$f":"'EE un ilgtsp.fin.novērt.'!B31","v":0}]
[null,null,null,null,{"$f":"'EE un ilgtsp.fin.novērt.'!B32","v":0}]
[null,null,null,null,{"$f":"'EE un ilgtsp.fin.novērt.'!B33","v":0}]
[null,null,null,null,{"$f":"'EE un ilgtsp.fin.novērt.'!B34","v":0}]
[null,"Lūdzu norādiet tabulā esošos un plānotos energoresursu apjomus, kuri tiks ietaupīti pēc projekta īstenošanas:",null,null,null,null,null,null,null,null,null,null,null,null,"Enerģijas ietaupījums"]
[]
[null,"Izejviela","Esošie apjomi gadā",null,null,null,null,"Izmaiņas pēc projekta īstenošanas",null,null,null,null,null,null,"Ietaupījums",null,"Ietaupījums uz 1 vienību"]
{"$rows_left_out":26}
{"sheet":"Izvelnes","index":8,"n_rows":32,"n_cols":8,"rows_kept":32,"cut":false,"hidden":true,"merged":[]}
[]
[null,"Mērvienība","Nr.",null,"Pasākums","Nr"]
[null,"kWh",1,null,"Energoefektivitātes pasākumi",1]
[null,"MWh",2,null,"Atjaunojamo energoresursu pasākumi (pašpatēriņam)",2]
[null,"m3",3,null,"Atjaunojamās enerģijas pasākumi",3,null,"Enerģijas izmaksu samazināšanas pasākumi"]
[null,"tonna",4,null,"Zaļo ēku pasākumi (jaunu ēku celtniecība)",4]
[null,"litri",5,null,"Zaļo ēku pasākumi (ēku atjaunošana)",5]
[null,"gab.",6,null,"Ilgtspējīga transporta risinājumi",6]
[null,"cits",7,null,"Enerģijas izmaksu samazināšanas pasākumi",7]
[null,null,null,null,"Pasākumi pārejai uz zema oglekļa ekonomiku",8]
[null,"Mērvienība","Nr."]
[null,"Benzīns, litri",9.61]
[null,"Dīzelis, litri",10.96]
[null,"Propāns, litri",6.98,null,"Visi produkti",false]
[null,"Elektrība, kWh",1]
[null,"Biodegviela, litri",10.96]
[null,"Kerosīns, litri",10.31]
[]
[]
[null,"Ienākumu tabulas izvēlne"]
{"$rows_left_out":12}